{"text_format":"1","workbook":"xlsx","n_sheets":8,"sheets":["Preparation","Liste_aliment","Menu","Généré_Course","Liste_de_course","Sauv_Menu","Liste_Menu","npt"],"not_rendered":{"charts":0,"images":1,"macros":1,"external_links":0,"defined_names":2,"comments":0,"pivot_tables":0},"unopened":[],"bounds":{"document_bytes":16777216,"sheet_cells":100000,"rows_first":2000,"rows_last":500,"rows_between":2000,"halvings":0,"cell_chars":16384,"cell_head_chars":4096},"cells_cut":0,"cells_raw":0,"read":"whole","date_system":"1900"}

{"sheet":"Preparation","index":0,"n_rows":36,"n_cols":13,"rows_kept":36,"cut":false,"hidden":false,"merged":[[17,1,17,3],[17,5,17,7],[1,1,1,3],[1,5,1,7],[7,1,7,3],[7,5,7,7],[34,1,34,3],[35,1,35,3],[22,1,22,3],[22,5,22,7],[27,1,27,3],[27,5,27,7],[33,1,33,3]]}
[]
[null,"HOMME",null,null,null,"FEMME"]
[null,"Age",26,"ans",null,"Age",1,"ans",null,null,"(1) Activité physique",null,"Ratio"]
[null,"Taille",1.88,"m",null,"Taille",1,"m",null,null,"Pas d'activité physique et emploi sédentaire",null,1.37]
[null,"Poids",95,"kg",null,"Poids",1,"kg",null,null,"Sport 1 à 2 fois par semaines",null,1.55]
[null,"Activité physique (1)",1.7,"-",null,"Activité physique (1)",1,"-",null,null,"Sport 3 à 4 fois par semaine",null,1.7]
[null,"Taux de masse grasse (2)",27,"%",null,"Taux de masse grasse (2)",1,"%",null,null,"Sport tous les jours",null,1.9]
[]
[null,"Besoin calorique basal",{"$f":"ROUND((259*((((C5^0.48)*(C4^0.5)*(C3^-0.13)))))*(1-C7/100),0)","v":1510},"cal",null,"Besoin calorique basal",{"$f":"ROUND((230*((((G5^0.48)*(G4^0.5)*(G3^-0.13)))))*(1-G7/100),0)","v":228},"cal"]
[null,"Besoin calorique quotidien",{"$f":"ROUND(C9*C6,0)","v":2567},"cal",null,"Besoin calorique quotidien",{"$f":"ROUND(G9*G6,0)","v":228},"cal"]
[null,null,null,null,null,null,null,null,null,null,"(2) Taux de masse grasse"]
[null,"Retirer quotidiennement :",550,"cal",null,"Retirer quotidiennement :",0,"cal"]
[null,"Apport quotidien final :",{"$f":"C10-C12","v":2017},"cal",null,"Apport quotidien final :",{"$f":"G10-G12","v":228},"cal"]
[]
[]
[]
[]
[null,"Apport quotidien - Paléo Masse",null,null,null,"Apport quotidien - Paléo Masse"]
[null,"Protéine",{"$f":"ROUND($C$5*2,2)","v":190},"g",null,"Protéine",{"$f":"ROUND($G$5*2,2)","v":2},"g"]
[null,"Lipide",{"$f":"ROUND((($C$13*50)/100)/9,2)","v":112.06},"g",null,"Lipide",{"$f":"ROUND((($G$13*50)/100)/9,2)","v":12.67},"g"]
{"$rows_left_out":17}
{"sheet":"Liste_aliment","index":1,"n_rows":53,"n_cols":15,"rows_kept":53,"cut":false,"hidden":false,"merged":[]}
["Aliment - Marque","Mesure pour","Calories","Protéines","Lipides","Glucides","Pour 1 personne","Notes","Poids à l'unité",null,null,null,null,null,"Lundi"]
["-","g / cl","g","g","g","g","g / cl","-","-",null,null,null,null,null,"Mardi"]
["Abricot",100,44,1,0,10,60,null,60,null,null,null,null,null,"Mercredi"]
["Amandes",100,578,19,54,4,25,null,25,null,null,null,null,null,"Jeudi"]
["Ananas",100,50,0.5,0,12,300,null,300,null,null,null,null,null,"Vendredi"]
["Artichaut cuit",100,47,3.3,0.2,11,300,null,300,null,null,null,null,null,"Samedi"]
["avocat - avocat",200,440,4,44,7,200,null,200,null,null,null,null,null,"Dimanche"]
["banane - banane",150,141.44999999999999,1.65,0.45,32.700000000000003,150,null,150]
["Baton de berger justin bridou",100,438,27,36,1,50,null,50]
["brocoli - brocoli",100,25,3,0.4,2.4,250,null,250]
["carrotte - carotte",100,26.3,0.8,0.3,5.0999999999999996,100,null,100]
["Cerise",100,77,1,0,17,8.1999999999999993,null,8.1999999999999993]
["Chocolat noir - Auchant 85%",100,591,8,51.6,16.8,20,null,20]
["chocolat noir - nestle dessert noir 52%",100,549,4.9000000000000004,34.700000000000003,50.6,25.6,null,25.6]
["Chou fleur",100,29,2.4,0.2,4.5,1500,null,1500]
["concombre - concombre",100,11.7,0.7,0.1,2,100,null,100]
["Cote de boeuf",100,257,17,21,0,400,null,400]
["Côte de porc surgele aldi",100,233,17.8,17.8,0.3,400,null,400]
["Courgette",100,33,1.3,0,6.5,100,null,100]
["crabe - baonet crabe carrefour tendre",100,116,7.4,4.3,12,100,null,100]
{"$rows_left_out":34}
{"sheet":"Menu","index":2,"n_rows":72,"n_cols":12,"rows_kept":72,"cut":false,"hidden":false,"merged":[]}
[]
[null,"Aliments","Quantité","Protéines","Lipides","Glucides","Calories"]
[]
[null,"MATIN",null,null,null,null,null,null,null,null,null,"Vendredi"]
[null,"oeuf - carrefour bio oeuf de poules",100,{"$f":"IF($B5=\"\",\"\",((INDEX(Liste_aliment!$A$3:$G$54,MATCH(Menu!$B5,Liste_Aliments),4))*$C5)/INDEX(Liste_aliment!$A$3:$G$54,MATCH(Menu!$B5,Liste_Aliments),2))","v":12.6},{"$f":"IF($B5=\"\",\"\",((INDEX(Liste_aliment!$A$3:$G$54,MATCH(Menu!$B5,Liste_Aliments),5))*$C5)/INDEX(Liste_aliment!$A$3:$G$54,MATCH(Menu!$B5,Liste_Aliments),2))","v":9.9},{"$f":"IF($B5=\"\",\"\",((INDEX(Liste_aliment!$A$3:$G$54,MATCH(Menu!$B5,Liste_Aliments),6))*$C5)/INDEX(Liste_aliment!$A$3:$G$54,MATCH(Menu!$B5,Liste_Aliments),2))","v":0.8},{"$f":"IF($B5=\"\",\"\",((INDEX(Liste_aliment!$A$3:$G$54,MATCH(Menu!$B5,Liste_Aliments),3))*$C5)/INDEX(Liste_aliment!$A$3:$G$54,MATCH(Menu!$B5,Liste_Aliments),2))","v":142}]
[null,"orange jus",300,{"$f":"IF($B6=\"\",\"\",((INDEX(Liste_aliment!$A$3:$G$54,MATCH(Menu!$B6,Liste_Aliments),4))*$C6)/INDEX(Liste_aliment!$A$3:$G$54,MATCH(Menu!$B6,Liste_Aliments),2))","v":0.3},{"$f":"IF($B6=\"\",\"\",((INDEX(Liste_aliment!$A$3:$G$54,MATCH(Menu!$B6,Liste_Aliments),5))*$C6)/INDEX(Liste_aliment!$A$3:$G$54,MATCH(Menu!$B6,Liste_Aliments),2))","v":0.03},{"$f":"IF($B6=\"\",\"\",((INDEX(Liste_aliment!$A$3:$G$54,MATCH(Menu!$B6,Liste_Aliments),6))*$C6)/INDEX(Liste_aliment!$A$3:$G$54,MATCH(Menu!$B6,Liste_Aliments),2))","v":33},{"$f":"IF($B6=\"\",\"\",((INDEX(Liste_aliment!$A$3:$G$54,MATCH(Menu!$B6,Liste_Aliments),3))*$C6)/INDEX(Liste_aliment!$A$3:$G$54,MATCH(Menu!$B6,Liste_Aliments),2))","v":57.9}]
[null,"Amandes",40,{"$f":"IF($B7=\"\",\"\",((INDEX(Liste_aliment!$A$3:$G$54,MATCH(Menu!$B7,Liste_Aliments),4))*$C7)/INDEX(Liste_aliment!$A$3:$G$54,MATCH(Menu!$B7,Liste_Aliments),2))","v":7.6},{"$f":"IF($B7=\"\",\"\",((INDEX(Liste_aliment!$A$3:$G$54,MATCH(Menu!$B7,Liste_Aliments),5))*$C7)/INDEX(Liste_aliment!$A$3:$G$54,MATCH(Menu!$B7,Liste_Aliments),2))","v":21.6},{"$f":"IF($B7=\"\",\"\",((INDEX(Liste_aliment!$A$3:$G$54,MATCH(Menu!$B7,Liste_Aliments),6))*$C7)/INDEX(Liste_aliment!$A$3:$G$54,MATCH(Menu!$B7,Liste_Aliments),2))","v":1.6},{"$f":"IF($B7=\"\",\"\",((INDEX(Liste_aliment!$A$3:$G$54,MATCH(Menu!$B7,Liste_Aliments),3))*$C7)/INDEX(Liste_aliment!$A$3:$G$54,MATCH(Menu!$B7,Liste_Aliments),2))","v":231.2},null,null,null,"Coeficient Matin",0.2]
[null,null,null,{"$f":"IF($B8=\"\",\"\",((INDEX(Liste_aliment!$A$3:$G$54,MATCH(Menu!$B8,Liste_Aliments),4))*$C8)/INDEX(Liste_aliment!$A$3:$G$54,MATCH(Menu!$B8,Liste_Aliments),2))","v":""},{"$f":"IF($B8=\"\",\"\",((INDEX(Liste_aliment!$A$3:$G$54,MATCH(Menu!$B8,Liste_Aliments),5))*$C8)/INDEX(Liste_aliment!$A$3:$G$54,MATCH(Menu!$B8,Liste_Aliments),2))","v":""},{"$f":"IF($B8=\"\",\"\",((INDEX(Liste_aliment!$A$3:$G$54,MATCH(Menu!$B8,Liste_Aliments),6))*$C8)/INDEX(Liste_aliment!$A$3:$G$54,MATCH(Menu!$B8,Liste_Aliments),2))","v":""},{"$f":"IF($B8=\"\",\"\",((INDEX(Liste_aliment!$A$3:$G$54,MATCH(Menu!$B8,Liste_Aliments),3))*$C8)/INDEX(Liste_aliment!$A$3:$G$54,MATCH(Menu!$B8,Liste_Aliments),2))","v":""},null,null,null,"Coeficient Midi",0.5]
[null,null,null,{"$f":"IF($B9=\"\",\"\",((INDEX(Liste_aliment!$A$3:$G$54,MATCH(Menu!$B9,Liste_Aliments),4))*$C9)/INDEX(Liste_aliment!$A$3:$G$54,MATCH(Menu!$B9,Liste_Aliments),2))","v":""},{"$f":"IF($B9=\"\",\"\",((INDEX(Liste_aliment!$A$3:$G$54,MATCH(Menu!$B9,Liste_Aliments),5))*$C9)/INDEX(Liste_aliment!$A$3:$G$54,MATCH(Menu!$B9,Liste_Aliments),2))","v":""},{"$f":"IF($B9=\"\",\"\",((INDEX(Liste_aliment!$A$3:$G$54,MATCH(Menu!$B9,Liste_Aliments),6))*$C9)/INDEX(Liste_aliment!$A$3:$G$54,MATCH(Menu!$B9,Liste_Aliments),2))","v":""},{"$f":"IF($B9=\"\",\"\",((INDEX(Liste_aliment!$A$3:$G$54,MATCH(Menu!$B9,Liste_Aliments),3))*$C9)/INDEX(Liste_aliment!$A$3:$G$54,MATCH(Menu!$B9,Liste_Aliments),2))","v":""},null,null,null,"Coeficient Collation",0.05]
[null,null,null,{"$f":"IF($B10=\"\",\"\",((INDEX(Liste_aliment!$A$3:$G$54,MATCH(Menu!$B10,Liste_Aliments),4))*$C10)/INDEX(Liste_aliment!$A$3:$G$54,MATCH(Menu!$B10,Liste_Aliments),2))","v":""},{"$f":"IF($B10=\"\",\"\",((INDEX(Liste_aliment!$A$3:$G$54,MATCH(Menu!$B10,Liste_Aliments),5))*$C10)/INDEX(Liste_aliment!$A$3:$G$54,MATCH(Menu!$B10,Liste_Aliments),2))","v":""},{"$f":"IF($B10=\"\",\"\",((INDEX(Liste_aliment!$A$3:$G$54,MATCH(Menu!$B10,Liste_Aliments),6))*$C10)/INDEX(Liste_aliment!$A$3:$G$54,MATCH(Menu!$B10,Liste_Aliments),2))","v":""},{"$f":"IF($B10=\"\",\"\",((INDEX(Liste_aliment!$A$3:$G$54,MATCH(Menu!$B10,Liste_Aliments),3))*$C10)/INDEX(Liste_aliment!$A$3:$G$54,MATCH(Menu!$B10,Liste_Aliments),2))","v":""},null,null,null,"Coeficient Soir",0.25]
[null,null,null,{"$f":"IF($B11=\"\",\"\",((INDEX(Liste_aliment!$A$3:$G$54,MATCH(Menu!$B11,Liste_Aliments),4))*$C11)/INDEX(Liste_aliment!$A$3:$G$54,MATCH(Menu!$B11,Liste_Aliments),2))","v":""},{"$f":"IF($B11=\"\",\"\",((INDEX(Liste_aliment!$A$3:$G$54,MATCH(Menu!$B11,Liste_Aliments),5))*$C11)/INDEX(Liste_aliment!$A$3:$G$54,MATCH(Menu!$B11,Liste_Aliments),2))","v":""},{"$f":"IF($B11=\"\",\"\",((INDEX(Liste_aliment!$A$3:$G$54,MATCH(Menu!$B11,Liste_Aliments),6))*$C11)/INDEX(Liste_aliment!$A$3:$G$54,MATCH(Menu!$B11,Liste_Aliments),2))","v":""},{"$f":"IF($B11=\"\",\"\",((INDEX(Liste_aliment!$A$3:$G$54,MATCH(Menu!$B11,Liste_Aliments),3))*$C11)/INDEX(Liste_aliment!$A$3:$G$54,MATCH(Menu!$B11,Liste_Aliments),2))","v":""},null,null,null,"Total = 1 ?",{"$f":"IF(SUM(L7:L10)=1,\"V\",\"X\")","v":"V"}]
[null,null,null,{"$f":"IF($B12=\"\",\"\",((INDEX(Liste_aliment!$A$3:$G$54,MATCH(Menu!$B12,Liste_Aliments),4))*$C12)/INDEX(Liste_aliment!$A$3:$G$54,MATCH(Menu!$B12,Liste_Aliments),2))","v":""},{"$f":"IF($B12=\"\",\"\",((INDEX(Liste_aliment!$A$3:$G$54,MATCH(Menu!$B12,Liste_Aliments),5))*$C12)/INDEX(Liste_aliment!$A$3:$G$54,MATCH(Menu!$B12,Liste_Aliments),2))","v":""},{"$f":"IF($B12=\"\",\"\",((INDEX(Liste_aliment!$A$3:$G$54,MATCH(Menu!$B12,Liste_Aliments),6))*$C12)/INDEX(Liste_aliment!$A$3:$G$54,MATCH(Menu!$B12,Liste_Aliments),2))","v":""},{"$f":"IF($B12=\"\",\"\",((INDEX(Liste_aliment!$A$3:$G$54,MATCH(Menu!$B12,Liste_Aliments),3))*$C12)/INDEX(Liste_aliment!$A$3:$G$54,MATCH(Menu!$B12,Liste_Aliments),2))","v":""}]
[null,null,null,{"$f":"IF($B13=\"\",\"\",((INDEX(Liste_aliment!$A$3:$G$54,MATCH(Menu!$B13,Liste_Aliments),4))*$C13)/INDEX(Liste_aliment!$A$3:$G$54,MATCH(Menu!$B13,Liste_Aliments),2))","v":""},{"$f":"IF($B13=\"\",\"\",((INDEX(Liste_aliment!$A$3:$G$54,MATCH(Menu!$B13,Liste_Aliments),5))*$C13)/INDEX(Liste_aliment!$A$3:$G$54,MATCH(Menu!$B13,Liste_Aliments),2))","v":""},{"$f":"IF($B13=\"\",\"\",((INDEX(Liste_aliment!$A$3:$G$54,MATCH(Menu!$B13,Liste_Aliments),6))*$C13)/INDEX(Liste_aliment!$A$3:$G$54,MATCH(Menu!$B13,Liste_Aliments),2))","v":""},{"$f":"IF($B13=\"\",\"\",((INDEX(Liste_aliment!$A$3:$G$54,MATCH(Menu!$B13,Liste_Aliments),3))*$C13)/INDEX(Liste_aliment!$A$3:$G$54,MATCH(Menu!$B13,Liste_Aliments),2))","v":""}]
[null,null,null,{"$f":"IF($B14=\"\",\"\",((INDEX(Liste_aliment!$A$3:$G$54,MATCH(Menu!$B14,Liste_Aliments),4))*$C14)/INDEX(Liste_aliment!$A$3:$G$54,MATCH(Menu!$B14,Liste_Aliments),2))","v":""},{"$f":"IF($B14=\"\",\"\",((INDEX(Liste_aliment!$A$3:$G$54,MATCH(Menu!$B14,Liste_Aliments),5))*$C14)/INDEX(Liste_aliment!$A$3:$G$54,MATCH(Menu!$B14,Liste_Aliments),2))","v":""},{"$f":"IF($B14=\"\",\"\",((INDEX(Liste_aliment!$A$3:$G$54,MATCH(Menu!$B14,Liste_Aliments),6))*$C14)/INDEX(Liste_aliment!$A$3:$G$54,MATCH(Menu!$B14,Liste_Aliments),2))","v":""},{"$f":"IF($B14=\"\",\"\",((INDEX(Liste_aliment!$A$3:$G$54,MATCH(Menu!$B14,Liste_Aliments),3))*$C14)/INDEX(Liste_aliment!$A$3:$G$54,MATCH(Menu!$B14,Liste_Aliments),2))","v":""}]
[]
[null,null,"Grammes :",{"$f":"SUM(D5:D14)","v":20.5},{"$f":"SUM(E5:E14)","v":31.53},{"$f":"SUM(F5:F14)","v":35.4},{"$f":"SUM(G5:G14)","v":431.1}]
[null,"Homme =>   ","Ideal :",{"$f":"ROUND(D71*L7,2)","v":30.26},{"$f":"ROUND(E71*L7,2)","v":22.41},{"$f":"ROUND(F71*L7,2)","v":20.170000000000002}]
[null,"Femme =>   ","Ideal :",{"$f":"ROUND(D72*L7,2)","v":3.42},{"$f":"ROUND(E72*L7,2)","v":2.5299999999999998},{"$f":"ROUND(F72*L7,2)","v":2.2799999999999998}]
[]
[null,"MIDI"]
{"$rows_left_out":53}
{"sheet":"Généré_Course","index":3,"n_rows":0,"n_cols":0,"rows_kept":0,"cut":false,"hidden":false,"merged":[]}

{"sheet":"Liste_de_course","index":4,"n_rows":15,"n_cols":3,"rows_kept":15,"cut":false,"hidden":false,"merged":[]}
["Article","Quantité (Grammes)","Quantité (Unité)"]
["oeuf - carrefour bio oeuf de poules",600,12]
["orange jus",1200,36.363636363636367]
["Amandes",300,12]
["poisson thon boite - petit navire thon entier au naturel",200,3.5714285714285716]
["Crevettes cuites",100,1]
["pomme - pomme",450,3.2142857142857144]
["haricot vert - haricot vert",200,0.8]
["poisson saumon - poisson saumon pave",200,1.3333333333333333]
["Epinard frais",200,2]
["huile olive - carrefour bio huile dolive vierfe extra",25,0.83333333333333337]
["steak haché - carrefour bio steak haché 100% muscle",600,4.8]
["brocoli - brocoli",800,3.2]
["banane - banane",300,2]
["poulet filet - carrefour filet de poulet france",400,2.8571428571428572]

{"sheet":"Sauv_Menu","index":5,"n_rows":64,"n_cols":55,"rows_kept":64,"cut":false,"hidden":false,"merged":[[1,41,1,46],[1,49,1,54],[1,1,1,6],[1,9,1,14],[1,17,1,22],[1,25,1,30],[1,33,1,38]]}
[]
[null,"Lundi",null,null,null,null,null,null,null,"Mardi",null,null,null,null,null,null,null,"Mercredi",null,null,null,null,null,null,null,"Jeudi",null,null,null,null,null,null,null,"Vendredi",null,null,null,null,null,null,null,"Samedi",null,null,null,null,null,null,null,"Dimanche"]
[]
[null,"Aliments","Quantité","Protéines","Lipides","Glucides","Calories",null,null,"Aliments","Quantité","Protéines","Lipides","Glucides","Calories",null,null,"Aliments","Quantité","Protéines","Lipides","Glucides","Calories",null,null,"Aliments","Quantité","Protéines","Lipides","Glucides","Calories",null,null,"Aliments","Quantité","Protéines","Lipides","Glucides","Calories",null,null,"Aliments","Quantité","Protéines","Lipides","Glucides","Calories",null,null,"Aliments","Quantité","Protéines","Lipides","Glucides","Calories"]
[]
[null,"MATIN",null,null,null,null,null,null,null,"MATIN",null,null,null,null,null,null,null,"MATIN",null,null,null,null,null,null,null,"MATIN",null,null,null,null,null,null,null,"MATIN",null,null,null,null,null,null,null,"MATIN",null,null,null,null,null,null,null,"MATIN"]
[null,null,null,"","","","",null,null,"oeuf - carrefour bio oeuf de poules",100,12.6,9.9,0.8,142,null,null,"oeuf - carrefour bio oeuf de poules",100,12.6,9.9,0.8,142,0.8,142,"oeuf - carrefour bio oeuf de poules",100,12.6,9.9,0.8,142,0.8,142,"oeuf - carrefour bio oeuf de poules",100,12.6,9.9,0.8,142,null,null,"oeuf - carrefour bio oeuf de poules",150,18.899999999999999,14.85,1.2,213,null,null,null,null,"","","",""]
[null,null,null,"","","","",null,null,"orange jus",300,0.3,0.03,33,57.9,null,null,"orange jus",300,0.3,0.03,33,57.9,3.63,63.69,"orange jus",300,0.3,0.03,33,57.9,3.63,63.69,"orange jus",300,0.3,0.03,33,57.9,null,null,"orange jus",300,0.3,0.03,33,57.9,null,null,null,null,"","","",""]
[null,null,null,"","","","",null,null,"Amandes",40,7.6,21.6,1.6,231.2,null,null,"Amandes",40,7.6,21.6,1.6,231.2,"","","Amandes",40,7.6,21.6,1.6,231.2,"","","Amandes",40,7.6,21.6,1.6,231.2,null,null,"Amandes",40,7.6,21.6,1.6,231.2,null,null,null,null,"","","",""]
[null,null,null,"","","","",null,null,null,null,"","","","",null,null,null,null,"","","","","","",null,null,"","","","","","",null,null,"","","","",null,null,null,null,"","","","",null,null,null,null,"","","",""]
[null,null,null,"","","","",null,null,null,null,"","","","",null,null,null,null,"","","","","","",null,null,"","","","","","",null,null,"","","","",null,null,null,null,"","","","",null,null,null,null,"","","",""]
[null,null,null,"","","","",null,null,null,null,"","","","",null,null,null,null,"","","","","","",null,null,"","","","","","",null,null,"","","","",null,null,null,null,"","","","",null,null,null,null,"","","",""]
[null,null,null,"","","","",null,null,null,null,"","","","",null,null,null,null,"","","","","","",null,null,"","","","","","",null,null,"","","","",null,null,null,null,"","","","",null,null,null,null,"","","",""]
[null,null,null,"","","","",null,null,null,null,"","","","",null,null,null,null,"","","","","","",null,null,"","","","","","",null,null,"","","","",null,null,null,null,"","","","",null,null,null,null,"","","",""]
[null,null,null,"","","","",null,null,null,null,"","","","",null,null,null,null,"","","","","","",null,null,"","","","","","",null,null,"","","","",null,null,null,null,"","","","",null,null,null,null,"","","",""]
[null,null,null,"","","","",null,null,null,null,"","","","",null,null,null,null,"","","","","","",null,null,"","","","","","",null,null,"","","","",null,null,null,null,"","","","",null,null,null,null,"","","",""]
[]
[null,"MIDI",null,null,null,null,null,null,null,"MIDI",null,null,null,null,null,null,null,"MIDI",null,null,null,null,null,null,null,"MIDI",null,null,null,null,null,null,null,"MIDI",null,null,null,null,null,null,null,"MIDI",null,null,null,null,null,null,null,"MIDI"]
[null,"poulet filet - carrefour filet de poulet france",350,72.45,3.15,7.7000000000000011,329,null,null,"poisson thon boite - petit navire thon entier au naturel",200,50,2,0.2,218,null,null,"steak haché - carrefour bio steak haché 100% muscle",300,57,36,0.6,555,0.2,185,null,null,"","","","",0.2,185,"steak haché - carrefour bio steak haché 100% muscle",300,57,36,0.6,555,null,null,"carrotte - carotte",150,1.2,0.45,7.65,39.450000000000003,null,null,"Homme =>   ","Ideal :",28.5,38.32,36.549999999999997]
[null,"avocat - avocat",100,2,22,3.5,220,null,null,"Crevettes cuites",100,18.100000000000001,0.8,0,80,null,null,"oeuf - carrefour bio oeuf de poules",100,12.6,9.9,0.8,142,6,62.5,null,null,"","","","",6,62.5,"oeuf - carrefour bio oeuf de poules",100,12.6,9.9,0.8,142,null,null,"oeuf - carrefour bio oeuf de poules",250,31.5,24.75,2,355,null,null,"Femme =>   ","Ideal :",0.3,4.33,7.05]
{"$rows_left_out":45}
{"sheet":"Liste_Menu","index":6,"n_rows":0,"n_cols":0,"rows_kept":0,"cut":false,"hidden":false,"merged":[]}

{"sheet":"npt","index":7,"n_rows":51,"n_cols":15,"rows_kept":51,"cut":false,"hidden":false,"merged":[]}
["Aliment - Marque","Mesure pour","Calories","Protéines","Lipides","Glucides","Pour 1 personne","Notes","Poids à l'unité",null,null,null,null,null,"Lundi"]
["-","g / cl","g","g","g","g","g / cl","-","-",null,null,null,null,null,"Mardi"]
["avocat - avocat",200,440,4,44,7,200,"1 avocat = 200g",200,null,null,null,null,null,"Mercredi"]
["banane - banane",150,141.44999999999999,1.65,0.45,32.700000000000003,150,"1 banane = 150g",150,null,null,null,null,null,"Jeudi"]
["brocoli - brocoli",100,25,3,0.4,2.4,250,"1 brocoli = 250g",250,null,null,null,null,null,"Vendredi"]
["carrotte - carotte",100,26.3,0.8,0.3,5.0999999999999996,100,"1 carotte = 100g",100,null,null,null,null,null,"Samedi"]
["chocolat noir - nestle dessert noir 52%",100,549,4.9000000000000004,34.700000000000003,50.6,25.6,"25,6g = 5 carrés",1,null,null,null,null,null,"Dimanche"]
["Chocolat noir - Auchant 85%",100,591,8,51.6,16.8,20,"1 carré = 10g",1]
["concombre - concombre",100,11.7,0.7,0.1,2,100,"1 concombre = 200g",200]
["crabe - baonet crabe carrefour tendre",100,116,7.4,4.3,12,100,"6 batonets = 100g",500]
["haricot vert - haricot vert",100,20.100000000000001,1.6,0.1,3.2,250,"Meme quantité que les brocoli",250]
["huile olive - carrefour bio huile dolive vierfe extra",100,822,0,91,0,"-","Bouteille = 1L",1000]
["jambon - herta le bon paris a letouffee qual supp",45,47,9,1.1000000000000001,0.2,45,"1 tranche = 45g",45]
["moutarde - Amora",100,161,7.9,12,4.4000000000000004,"-","Pot = 200g - 1 Cuillere = 15ml",200]
["oeuf - carrefour bio oeuf de poules",100,142,12.6,9.9,0.8,150,"1 Oeuf = 50g",50]
["orange jus",100,193,0.1,0.01,11,33,"1 mog = 33cl",1000]
["poisson cabillau - poisson cabillau",100,78.7,18.100000000000001,0.7,0,150,"-",150]
["poisson merlan - poisson merlan",100,79.5,18.7,0.3,0.5,150,"-",150]
["poisson saumon - poisson saumon pave",100,179.5,20.8,10.7,0,150,"-",150]
["poisson thon - poisson thon",100,118,25,2,0,150,"-",150]
{"$rows_left_out":31}